Reaction Details
TargetNeprilysin
LigandBDBM50283661
Substrate/Competitorn/a
Meas. Tech.ChEBML_144632
IC50>1000±n/a nM
Citation De Lombaert, STan, JStamford, LJSakane, YBerry, CGhai, RD Dual inhibition of neutral endopeptidase and angiotensin-converting enzyme by N-phosphonomethyl and N-carboxyalkyl dipeptides Bioorg Med Chem Lett4:2715-2720 (1994)    Article
 
Neprilysin
Name:Neprilysin
Type:Enzyme
Mol. Mass.:85505.38
Organism:Homo sapiens (Human)
Description:P08473
Residue:750
BDBM50283661
NameBDBM50283661
Synonyms:(S)-3-Biphenyl-4-yl-2-[(S)-3-(2-methoxy-phenyl)-2-(phosphonomethyl-amino)-propionylamino]-propionic acid | CHEMBL93785
TypeSmall organic molecule
Emp. Form.C26H29N2O7P
Mol. Mass.512.4914
SMILESCOc1ccccc1C[C@H](NCP(O)(O)=O)C(=O)N[C@@H](Cc1ccc(cc1)-c1ccccc1)C(O)=O