Reaction Details
TargetEndothelin receptor type B
LigandBDBM50284769
Substrate/Competitorn/a
Meas. Tech.ChEBML_63681
IC50 0.800000±n/a nM
Citation Fukami, TYamakawa, TKojima, HAmano, YIhara, MYano, MIshikawa, K Synthesis of 2-substituted d-tryptophan-containing peptide derivatives with endothelin receptor antagonist activity Bioorg Med Chem Lett5:1483-1488 (1995)    Article
 
Endothelin receptor type B
Name:Endothelin receptor type B
Type:Enzyme Catalytic Domain
Mol. Mass.:49664.00
Organism:Homo sapiens (Human)
Description:ENDOTHELIN B EDNRB HUMAN::P24530
Residue:442
BDBM50284769
NameBDBM50284769
Synonyms:(S)-2-((R)-3-(2-Bromo-1H-indol-3-yl)-2-{(S)-2-cyclopropyl-2-[((2R,6S)-2,6-dimethyl-piperidine-1-carbonyl)-amino]-acetylamino}-propionylamino)-hexanoic acid | CHEMBL284250
TypeSmall organic molecule
Emp. Form.C30H42BrN5O5
Mol. Mass.632.589
SMILESCCCC[C@H](NC(=O)[C@@H](Cc1c(Br)[nH]c2ccccc12)NC(=O)[C@@H](NC(=O)N1[C@@H](C)CCC[C@H]1C)C1CC1)C(O)=O