Reaction Details
TargetProgesterone receptor
LigandBDBM50366382
Substrate/Competitorn/a
Meas. Tech.ChEBML_159714
IC50 1.2±n/a nM
Citation Zhong-Qi, WangShou-Fu, LuLin, ChaoChuan-Jun, Yang An efficient synthesis and biological activities of 19-nor-17-hydroxy-17-trifluoromethyl-4-estren-3-one and its analogs Bioorg Med Chem Lett5:1899-1902 (1995)    Article
 
Progesterone receptor
Name:Progesterone receptor
Type:PROTEIN
Mol. Mass.:99414.34
Organism:Rattus norvegicus
Description:ChEMBL_159714
Residue:923
BDBM50366382
NameBDBM50366382
Synonyms:CHEMBL57078
TypeSmall organic molecule
Emp. Form.C19H25F3O2
Mol. Mass.342.3958
SMILESC[C@]12CCC3C(CCC4=CC(=O)CC[C@H]34)C1CC[C@@]2(O)C(F)(F)F