Reaction Details
TargetProtein kinase C zeta type
LigandBDBM50285237
Substrate/Competitorn/a
Meas. Tech.ChEBML_161464
IC50 12500±n/a nM
Citation Lai, YMendoza, JHubbard, FKalter, K Synthesis and PKC inhibitory activities of balanol analogs with a cyclopentane substructure Bioorg Med Chem Lett5:2155-2160 (1995)    Article
 
Protein kinase C zeta type
Name:Protein kinase C zeta type
Type:Enzyme
Mol. Mass.:67649.13
Organism:Homo sapiens (Human)
Description:n/a
Residue:592
BDBM50285237
NameBDBM50285237
Synonyms:4-(2-Carboxy-6-hydroxy-benzoyl)-3,5-dihydroxy-benzoic acid (3S,5R)-4-hydroxy-2-((S)-4-hydroxy-benzoylamino)-cyclopentyl ester | CHEMBL67716
TypeSmall organic molecule
Emp. Form.C27H23NO11
Mol. Mass.537.4716
SMILESO[C@H]1C[C@H](NC(=O)c2ccc(O)cc2)[C@@H](C1)OC(=O)c1cc(O)c(C(=O)c2c(O)cccc2C(O)=O)c(O)c1