Reaction Details
TargetDNA topoisomerase 2-alpha/2-beta
LigandBDBM50286485
Substrate/Competitorn/a
Meas. Tech.ChEMBL_208605 (CHEMBL812282)
EC50 1700±n/a nM
Citation Wentland, MPAldous, SCGruett, MDPerni, RBPowles, RGDanz, DWKlingbeil, KMPeverly, ARobinson, RGCorbett, THRake, JBCoughlin, SA The antitumor activity of novel pyrazoloquinoline derivatives Bioorg Med Chem Lett5:405-410 (1995)    Article
 
DNA topoisomerase 2-alpha/2-beta
Name:DNA topoisomerase 2-alpha/2-beta
Synonyms:DNA topoisomerase II
Type:n/a
Mol. Mass.:n/a
Description:ASSAY_ID of ChEMBL is 1821483
Components:This complex has 2 components.
Component 1
Name:DNA topoisomerase 2-alpha
Type:Protein
Mol. Mass.:174415.30
Organism:Homo sapiens (Human)
Description:P11388
Residue:1531
Component 2
Name:DNA topoisomerase 2-beta
Synonyms:DNA topoisomerase II TOP2B | TOP2B_HUMAN
Type:PROTEIN
Mol. Mass.:183284.13
Organism:Homo sapiens (Human)
Description:ChEMBL_51583
Residue:1626
BDBM50286485
NameBDBM50286485
Synonyms:5-Cyclopropyl-7-(2,6-dimethyl-pyridin-4-yl)-6,8-difluoro-2-(tetrahydro-pyran-4-yl)-2,5-dihydro-pyrazolo[4,3-c]quinolin-3-one | CHEMBL421899
TypeSmall organic molecule
Emp. Form.C25H24F2N4O2
Mol. Mass.450.4805
SMILESCc1cc(cc(C)n1)-c1c(F)cc2c3nn(C4CCOCC4)c(=O)c3cn(C3CC3)c2c1F