Reaction Details
Target5-hydroxytryptamine receptor 3A/3B
LigandBDBM50056419
Substrate/Competitorn/a
Meas. Tech.ChEBML_2977
Ki 0.200000±n/a nM
Citation Langlois, MYang, DBremont, BShen, S Synthesis and pharmacological activity of a macrocyclic benzamide Bioorg Med Chem Lett5:795-798 (1995)    Article
 
5-hydroxytryptamine receptor 3A/3B
Name:5-hydroxytryptamine receptor 3A/3B
Type:n/a
Mol. Mass.:n/a
Description:ASSAY_ID of EBI is 2974
Components:This complex has 2 components.
Component 1
Name:5-hydroxytryptamine receptor 3B
Synonyms:5HT3B_RAT Serotonin (5-HT) receptor
Type:PROTEIN
Mol. Mass.:50328.78
Organism:Rattus norvegicus
Description:EBI_11885
Residue:437
Component 2
Name:5-hydroxytryptamine receptor 3A
Synonyms:5-HT3 5HT3A_RAT Htr3 Serotonin (5-HT) receptor | Zacopride site-R
Type:Enzyme Catalytic Domain
Mol. Mass.:55428.70
Organism:RAT
Description:5-HT3 HTR3A RAT::P35563
Residue:483
BDBM50056419
NameBDBM50056419
Synonyms:4-Amino-N-(1-aza-bicyclo[2.2.2]oct-3-yl)-5-chloro-2-((S)-methoxy)-benzamide 4-Amino-N-(S)-1-aza-bicyclo[2.2.2]oct-3-yl-5-chloro-2-methoxy-benzamide ZACOPRIDE,R
TypeSmall organic molecule
Emp. Form.C15H20ClN3O2
Mol. Mass.309.791
SMILESCOc1cc(N)c(Cl)cc1C(=O)N[C@@H]1CN2CCC1CC2