Reaction Details
Target5-hydroxytryptamine receptor 3A/3B
LigandBDBM50083178
Substrate/Competitorn/a
Meas. Tech.ChEMBL_3139 (CHEMBL617981)
Ki 4.9±n/a nM
Citation Lopez-Rodriguez, MLMorcillo, MJBenhamu, BRiaguas, MD Novel benzimidazole-4-carboxylic acid derivatives as potent and selective 5-HT3 receptor ligands Bioorg Med Chem Lett6:1195-1198 (1996)    Article
 
5-hydroxytryptamine receptor 3A/3B
Name:5-hydroxytryptamine receptor 3A/3B
Type:n/a
Mol. Mass.:n/a
Description:ASSAY_ID of EBI is 2974
Components:This complex has 2 components.
Component 1
Name:5-hydroxytryptamine receptor 3B
Synonyms:5HT3B_RAT Serotonin (5-HT) receptor
Type:PROTEIN
Mol. Mass.:50328.78
Organism:Rattus norvegicus
Description:EBI_11885
Residue:437
Component 2
Name:5-hydroxytryptamine receptor 3A
Synonyms:5-HT3 5HT3A_RAT Htr3 Serotonin (5-HT) receptor | Zacopride site-R
Type:Enzyme Catalytic Domain
Mol. Mass.:55428.70
Organism:RAT
Description:5-HT3 HTR3A RAT::P35563
Residue:483
BDBM50083178
NameBDBM50083178
Synonyms:6-Chloro-1H-benzoimidazole-4-carboxylic acid 9-methyl-9-aza-bicyclo[3.3.1]non-3-yl ester | CHEMBL19039
TypeSmall organic molecule
Emp. Form.C17H20ClN3O2
Mol. Mass.333.813
SMILESCN1C2CCCC1CC(C2)OC(=O)c1cc(Cl)cc2[nH]cnc12