Reaction Details
TargetHLA class II histocompatibility antigen, DR beta 3 chain
LigandBDBM50287636
Substrate/Competitorn/a
Meas. Tech.ChEBML_47860
IC50 162±n/a nM
Citation Hanson, GJVuletich, JLBedell, LJBono, CPHoward, SCWelply, JKWoulfe, SLZacheis, ML Design of MHC class II (DR4) ligands using conformationally restricted imino acids at p3 and p5 Bioorg Med Chem Lett6:1931-1936 (1996)    Article
 
HLA class II histocompatibility antigen, DR beta 3 chain
Name:HLA class II histocompatibility antigen, DR beta 3 chain
Type:PROTEIN
Mol. Mass.:29969.73
Organism:Homo sapiens (Human)
Description:ChEMBL_47860
Residue:266
BDBM50287636
NameBDBM50287636
Synonyms:(S)-3-({1-[(S)-6-Amino-2-((S)-3-cyclohexyl-butyrylamino)-hexanoyl]-piperidine-2-carbonyl}-amino)-4-[(S)-2-((1S,2R)-2-hydroxy-1-propylcarbamoyl-propylcarbamoyl)-pyrrolidin-1-yl]-4-oxo-butyric acid | CHEMBL2373032
TypeSmall organic molecule
Emp. Form.C38H65N7O9
Mol. Mass.763.9642
SMILESCCCNC(=O)[C@@H](NC(=O)[C@@H]1CCCN1C(=O)[C@H](CC(O)=O)NC(=O)[C@@H]1CCCCN1C(=O)[C@H](CCCCN)NC(=O)C[C@@H](C)C1CCCCC1)[C@@H](C)O