Reaction Details
TargetHLA class II histocompatibility antigen, DR beta 3 chain
LigandBDBM50366443
Substrate/Competitorn/a
Meas. Tech.ChEBML_47860
IC50 1800±n/a nM
Citation Hanson, GJVuletich, JLBedell, LJBono, CPHoward, SCWelply, JKWoulfe, SLZacheis, ML Design of MHC class II (DR4) ligands using conformationally restricted imino acids at p3 and p5 Bioorg Med Chem Lett6:1931-1936 (1996)    Article
 
HLA class II histocompatibility antigen, DR beta 3 chain
Name:HLA class II histocompatibility antigen, DR beta 3 chain
Type:PROTEIN
Mol. Mass.:29969.73
Organism:Homo sapiens (Human)
Description:ChEMBL_47860
Residue:266
BDBM50366443
NameBDBM50366443
Synonyms:CHEMBL1790407
TypeSmall organic molecule
Emp. Form.C36H63N7O9
Mol. Mass.737.9269
SMILESCCCNC(=O)[C@@H](NC(=O)[C@@H]1CCCN1C(=O)[C@H](CC(O)=O)NC(=O)[C@H](C)N(C)C(=O)[C@H](CCCCN)NC(=O)C[C@H](C)C1CCCCC1)[C@@H](C)O