Reaction Details
TargetKynureninase
LigandBDBM50288255
Substrate/Competitorn/a
Meas. Tech.ChEBML_91720
Ki 4280±n/a nM
Citation Ross, FCBotting, NPLeeson, PD Synthesis of phosphinic acid transition state analogues for the reaction catalysed by kynureninase Bioorg Med Chem Lett6:2643-2646 (1996)    Article
 
Kynureninase
Name:Kynureninase
Type:PROTEIN
Mol. Mass.:52356.52
Organism:Homo sapiens (Human)
Description:ChEMBL_91729
Residue:465
BDBM50288255
NameBDBM50288255
Synonyms:2-ammonio-4-(2-ammoniophenyl)-4-oxo-(2S)-butanoate
TypeSmall organic molecule
Emp. Form.C10H13N2O3
Mol. Mass.209.2213
SMILES[NH3+][C@@H](CC(=O)c1ccccc1[NH3+])C([O-])=O