Reaction Details
Target3-phosphoshikimate 1-carboxyvinyltransferase
LigandBDBM50403585
Substrate/Competitorn/a
Meas. Tech.ChEBML_64947
Ki 32±n/a nM
Citation Peterson, MLCorey, SDFont, JLWalker, MCSikorski, JA New simplified inhibitors of EPSP synthase: The importance of ring size for recognition at the shikimate 3-phosphate site Bioorg Med Chem Lett6:2853-2858 (1996)    Article
 
3-phosphoshikimate 1-carboxyvinyltransferase
Name:3-phosphoshikimate 1-carboxyvinyltransferase
Type:PROTEIN
Mol. Mass.:46089.22
Organism:Escherichia coli (strain K12)
Description:ChEMBL_65087
Residue:427
BDBM50403585
NameBDBM50403585
Synonyms:CHEMBL1627010
TypeSmall organic molecule
Emp. Form.C10H12F3O14P2
Mol. Mass.475.1372
SMILESO[C@H]1[C@@H](CC(=C[C@H]1OP(O)(O)=O)C([O-])=O)O[C@](OP(O)(O)=O)(C(O)=O)C(F)(F)F