Reaction Details
Target5-hydroxytryptamine receptor 4
LigandBDBM50288586
Substrate/Competitorn/a
Meas. Tech.ChEMBL_3344 (CHEMBL619044)
Ki 115±n/a nM
Citation Fancelli, DCaccia, CFornaretto, MMcArthur, RSeverino, DVaghi, FVarasi, M Serotoninergic 5-HT3 and 5-HT4 receptor activities of dihydrobenzofuran carboxylic acid derivatives Bioorg Med Chem Lett6:263-266 (1996)    Article
 
5-hydroxytryptamine receptor 4
Name:5-hydroxytryptamine receptor 4
Type:Enzyme Catalytic Domain
Mol. Mass.:46117.31
Organism:RAT
Description:5-HT4 HTR4 RAT::Q62758
Residue:406
BDBM50288586
NameBDBM50288586
Synonyms:2-(4-amino-5-chloro-2,3-dihydrobenzo[b]furan-7-ylcarboxamido)-(2R)-4-azabicyclo[2.2.2]octane | CHEMBL89259
TypeSmall organic molecule
Emp. Form.C16H20ClN3O2
Mol. Mass.321.802
SMILESNc1c2CCOc2c(cc1Cl)C(=O)N[C@H]1CN2CCC1CC2