Reaction Details
Target5-hydroxytryptamine receptor 4
LigandBDBM50288596
Substrate/Competitorn/a
Meas. Tech.ChEMBL_3344 (CHEMBL619044)
Ki 9.6±n/a nM
Citation Fancelli, DCaccia, CFornaretto, MMcArthur, RSeverino, DVaghi, FVarasi, M Serotoninergic 5-HT3 and 5-HT4 receptor activities of dihydrobenzofuran carboxylic acid derivatives Bioorg Med Chem Lett6:263-266 (1996)    Article
 
5-hydroxytryptamine receptor 4
Name:5-hydroxytryptamine receptor 4
Type:Enzyme Catalytic Domain
Mol. Mass.:46117.31
Organism:RAT
Description:5-HT4 HTR4 RAT::Q62758
Residue:406
BDBM50288596
NameBDBM50288596
Synonyms:4-Amino-5-chloro-2,3-dihydro-benzofuran-7-carboxylic acid (3-piperidin-1-yl-propyl)-amide | CHEMBL327798
TypeSmall organic molecule
Emp. Form.C17H24ClN3O2
Mol. Mass.337.844
SMILESNc1c2CCOc2c(cc1Cl)C(=O)NCCCN1CCCCC1