Reaction Details
TargetProstaglandin G/H synthase 1
LigandBDBM50022309
Substrate/Competitorn/a
Meas. Tech.ChEBML_159569
IC50 3000±n/a nM
Citation Look, GCSchullek, JRHolmes, CPChinn, JPGordon, EMGallop, MA The identification of cyclooxygenase-1 inhibitors from 4-thiazolidinone combinatorial libraries Bioorg Med Chem Lett6:707-712 (1996)    Article
 
Prostaglandin G/H synthase 1
Name:Prostaglandin G/H synthase 1
Type:Enzyme
Mol. Mass.:68692.62
Organism:Homo sapiens (Human)
Description:P23219
Residue:599
BDBM50022309
NameBDBM50022309
Synonyms:3,5-Dioxo-1,2-diphenyl-4-n-butylpyrazolidine 4-n-Butyl-1,2-diphenyl-3,5-pyrazolidinedione PHENYLBUTAZONE | Phenylbutazon
TypeSmall organic molecule
Emp. Form.C19H20N2O2
Mol. Mass.308.3743
SMILESCCCCc1c(O)n(-c2ccccc2)n(-c2ccccc2)c1=O