Reaction Details
TargetSerine protease 1
LigandBDBM50289530
Substrate/Competitorn/a
Meas. Tech.ChEBML_212727
Ki 2100±n/a nM
Citation Sanderson, PEDyer, DLNaylor-Olsen, AMVacca, JPGardell, SJDale Lewis, SLucas, BJLyle, EALynch, JJMulichak, AM L-373,890, An achiral, noncovalent, subnanomolar thrombin inhibitor Bioorg Med Chem Lett7:1497-1500 (1997)    Article
 
Serine protease 1
Name:Serine protease 1
Type:Enzyme
Mol. Mass.:26557.80
Organism:Homo sapiens (Human)
Description:P07477
Residue:247
BDBM50289530
NameBDBM50289530
Synonyms:CHEMBL3085115 | N-(4-Amino-cyclohexylmethyl)-2-[6-methyl-2-oxo-3-(toluene-4-sulfonylamino)-2H-pyridin-1-yl]-acetamide
TypeSmall organic molecule
Emp. Form.C22H30N4O4S
Mol. Mass.446.563
SMILESCc1ccc(cc1)S(=O)(=O)Nc1ccc(C)n(CC(=O)NC[C@H]2CC[C@H](N)CC2)c1=O