Reaction Details
TargetAntithrombin-III
LigandBDBM50421408
Substrate/Competitorn/a
Meas. Tech.ChEBML_35871
Kd 1.9±n/a nM
Citation Helmboldt, APetitou, MMallet, JHerault, JLormeau, JDriguez, PAHerbert, JSinay, P Synthesis and biological activity of a new anti-factor Xa pentasaccharide with a C-interglycosidic bond Bioorg Med Chem Lett7:1507-1510 (1997)    Article
 
Antithrombin-III
Name:Antithrombin-III
Type:PROTEIN
Mol. Mass.:52602.34
Organism:Homo sapiens (Human)
Description:ChEMBL_35871
Residue:464
BDBM50421408
NameBDBM50421408
Synonyms:CHEMBL2303815
TypeSmall organic molecule
Emp. Form.C38H64O49S7
Mol. Mass.1529.34
SMILESCO[C@H]1O[C@@H](COS(O)(=O)=O)[C@@H](O[C@@H]2O[C@H]([C@H](O[C@H]3O[C@@H](COS(O)(=O)=O)[C@@H](O[C@@H]4O[C@H]([C@@H](O[C@H]5O[C@@H](COS(O)(=O)=O)[C@@H](OC)[C@H](OC)[C@@H]5OC)[C@H](OC)[C@@H]4OC)C(O)=O)[C@H](OS(O)(=O)=O)[C@@H]3OS(O)(=O)=O)[C@H](OC)[C@H]2OC)C(O)=O)[C@H](OS(O)(=O)=O)[C@@H]1OS(O)(=O)=O