Reaction Details
TargetRetinoic acid receptor gamma
LigandBDBM50048294
Substrate/Competitorn/a
Meas. Tech.ChEBML_196013
Ki 200±n/a nM
Citation Diaz, PMichel, SStella, LCharpentier, B Synthesis and biological activities of new heterocyclic aromatic retinoids Bioorg Med Chem Lett7:2289-2294 (1997)    Article
 
Retinoic acid receptor gamma
Name:Retinoic acid receptor gamma
Type:PROTEIN
Mol. Mass.:50345.43
Organism:Homo sapiens (Human)
Description:ChEMBL_1458016
Residue:454
BDBM50048294
NameBDBM50048294
Synonyms:6-(3-tert-Butyl-4-hydroxy-phenyl)-naphthalene-2-carboxylic acid CHEMBL74218
TypeSmall organic molecule
Emp. Form.C21H20O3
Mol. Mass.320.3817
SMILESCC(C)(C)c1cc(ccc1O)-c1ccc2cc(ccc2c1)C(O)=O