Reaction Details
TargetRetinoic acid receptor alpha
LigandBDBM50290079
Substrate/Competitorn/a
Meas. Tech.ChEBML_197414
Ki 5787±n/a nM
Citation Diaz, PMichel, SStella, LCharpentier, B Synthesis and biological activities of new heterocyclic aromatic retinoids Bioorg Med Chem Lett7:2289-2294 (1997)    Article
 
Retinoic acid receptor alpha
Name:Retinoic acid receptor alpha
Type:PROTEIN
Mol. Mass.:50778.87
Organism:Homo sapiens (Human)
Description:ChEMBL_1466191
Residue:462
BDBM50290079
NameBDBM50290079
Synonyms:3-(5,5,8,8-Tetramethyl-5,6,7,8-tetrahydro-naphthalen-2-yl)-chroman-7-carboxylic acid | CHEMBL75527
TypeSmall organic molecule
Emp. Form.C24H28O3
Mol. Mass.364.4773
SMILESCC1(C)CCC(C)(C)c2cc(ccc12)C1COc2cc(ccc2C1)C(O)=O