Reaction Details
TargetRetinoic acid receptor gamma
LigandBDBM50048280
Substrate/Competitorn/a
Meas. Tech.ChEBML_196013
Ki 130±n/a nM
Citation Diaz, PMichel, SStella, LCharpentier, B Synthesis and biological activities of new heterocyclic aromatic retinoids Bioorg Med Chem Lett7:2289-2294 (1997)    Article
 
Retinoic acid receptor gamma
Name:Retinoic acid receptor gamma
Type:PROTEIN
Mol. Mass.:50345.43
Organism:Homo sapiens (Human)
Description:ChEMBL_1458016
Residue:454
BDBM50048280
NameBDBM50048280
Synonyms:6-(3-(1-Adamantyl)-4-methoxyphenyl)-2-naphthoic acid ADAPALENE | CHEMBL1265
TypeSmall organic molecule
Emp. Form.C28H28O3
Mol. Mass.412.5201
SMILESCOc1ccc(cc1C12CC3CC(CC(C3)C1)C2)-c1ccc2cc(ccc2c1)C(O)=O