Reaction Details
TargetD(3) dopamine receptor
LigandBDBM50290206
Substrate/Competitorn/a
Meas. Tech.ChEBML_58772
Ki 0.500000±n/a nM
Citation Belliotti, TRKesten, SRRubin, JRWustrow, DJGeorgic, LMZoski, KTAkunne, HCWise, LD Novel cyclohexyl amides as potent and selective D3 dopamine receptor ligands Bioorg Med Chem Lett7:2403-2408 (1997)    Article
 
D(3) dopamine receptor
Name:D(3) dopamine receptor
Type:n/a
Mol. Mass.:44243.43
Organism:Homo sapiens (Human)
Description:n/a
Residue:400
BDBM50290206
NameBDBM50290206
Synonyms:CHEMBL78800 | Thiophene-2-carboxylic acid (4-{2-[4-(2-chloro-phenyl)-piperazin-1-yl]-ethyl}-cyclohexyl)-amide
TypeSmall organic molecule
Emp. Form.C23H30ClN3OS
Mol. Mass.432.022
SMILESClc1ccccc1N1CCN(CC[C@H]2CC[C@@H](CC2)NC(=O)c2cccs2)CC1