Reaction Details
TargetD(3) dopamine receptor
LigandBDBM50290221
Substrate/Competitorn/a
Meas. Tech.ChEBML_58772
Ki 1.8±n/a nM
Citation Belliotti, TRKesten, SRRubin, JRWustrow, DJGeorgic, LMZoski, KTAkunne, HCWise, LD Novel cyclohexyl amides as potent and selective D3 dopamine receptor ligands Bioorg Med Chem Lett7:2403-2408 (1997)    Article
 
D(3) dopamine receptor
Name:D(3) dopamine receptor
Type:n/a
Mol. Mass.:44243.43
Organism:Homo sapiens (Human)
Description:n/a
Residue:400
BDBM50290221
NameBDBM50290221
Synonyms:CHEMBL80919 | Thiophene-2-carboxylic acid (4-{2-[4-(2,3-dichloro-phenyl)-piperazin-1-yl]-ethyl}-cyclohexyl)-amide
TypeSmall organic molecule
Emp. Form.C23H29Cl2N3OS
Mol. Mass.466.467
SMILESClc1cccc(N2CCN(CC[C@H]3CC[C@@H](CC3)NC(=O)c3cccs3)CC2)c1Cl