Reaction Details
TargetD(3) dopamine receptor
LigandBDBM50290229
Substrate/Competitorn/a
Meas. Tech.ChEBML_58772
Ki 4.3±n/a nM
Citation Belliotti, TRKesten, SRRubin, JRWustrow, DJGeorgic, LMZoski, KTAkunne, HCWise, LD Novel cyclohexyl amides as potent and selective D3 dopamine receptor ligands Bioorg Med Chem Lett7:2403-2408 (1997)    Article
 
D(3) dopamine receptor
Name:D(3) dopamine receptor
Type:n/a
Mol. Mass.:44243.43
Organism:Homo sapiens (Human)
Description:n/a
Residue:400
BDBM50290229
NameBDBM50290229
Synonyms:CHEMBL78406 Thiophene-2-carboxylic acid {4-[2-(4-pyridin-2-yl-piperazin-1-yl)-ethyl]-cyclohexyl}-amide
TypeSmall organic molecule
Emp. Form.C22H30N4OS
Mol. Mass.398.565
SMILESO=C(N[C@H]1CC[C@H](CCN2CCN(CC2)c2ccccn2)CC1)c1cccs1