Reaction Details
TargetSodium-dependent dopamine transporter
LigandBDBM22167
Substrate/Competitorn/a
Meas. Tech.ChEBML_61990
IC50 37±n/a nM
Citation Hanson, RNChoi, SElmaleh, DRFischman, AJ Synthesis and evaluation of novel-N-[2-(bis-aryl-methoxy)ethyl-N-aralkyl-,-alkanediamines as potent and selective dopamine reuptake inhibitors: Seco analogs of GBR12935 and GBR12909 Bioorg Med Chem Lett7:2559-2564 (1997)    Article
 
Sodium-dependent dopamine transporter
Name:Sodium-dependent dopamine transporter
Type:Multi-pass membrane protein
Mol. Mass.:68749.45
Organism:Rattus norvegicus (rat)
Description:P23977
Residue:619
BDBM22167
NameBDBM22167
Synonyms:1-[2-(diphenylmethoxy)ethyl]-4-(3-phenylpropyl)piperazine CHEMBL434080 GBR-12935
TypeSmall organic molecule
Emp. Form.C28H34N2O
Mol. Mass.414.5824
SMILESC(CN1CCN(CCOC(c2ccccc2)c2ccccc2)CC1)Cc1ccccc1