Reaction Details
TargetCyclin-dependent kinase 2/G1/S-specific cyclin-E1/G1/S-specific cyclin-E2
LigandBDBM50290602
Substrate/Competitorn/a
Meas. Tech.ChEMBL_42810 (CHEMBL877293)
IC50 1000±n/a nM
Citation Schow, SRMackman, RLBlum, CLBrooks, EHorsma, AGJoly, AKerwar, SSLee, GShiffman, DNelson, MGWang, XWick, MMZhang, XLum, RT Synthesis and activity of 2,6,9-trisubstituted purines Bioorg Med Chem Lett7:2697-2702 (1997)    Article
 
Cyclin-dependent kinase 2/G1/S-specific cyclin-E1/G1/S-specific cyclin-E2
Name:Cyclin-dependent kinase 2/G1/S-specific cyclin-E1/G1/S-specific cyclin-E2
Type:n/a
Mol. Mass.:n/a
Description:ASSAY_ID of EBI is 52510
Components:This complex has 3 components.
Component 1
Name:G1/S-specific cyclin-E2
Synonyms:CCNE2 CDK3/cyclin E | G1/S-specific cyclin-E2
Type:PROTEIN
Mol. Mass.:46763.82
Organism:Homo sapiens (Human)
Description:EBI_10135
Residue:404
Component 2
Name:Cyclin-dependent kinase 2
Synonyms:CDK2 CDK2_HUMAN Cell division protein kinase 2 Protein cereblon/Cyclin-dependent kinase 2 | p33 protein kinase
Type:Enzyme Subunit
Mol. Mass.:33938.17
Organism:Homo sapiens (Human)
Description:P24941
Residue:298
Component 3
Name:G1/S-specific cyclin-E1
Synonyms:CCNE CCNE1_HUMAN
Type:Enzyme Subunit
Mol. Mass.:47073.17
Organism:Homo sapiens (Human)
Description:n/a
Residue:410
BDBM50290602
NameBDBM50290602
Synonyms:3-{[9-Isopropyl-6-(4-methoxy-benzylamino)-9H-purin-2-yl]-pyridin-3-ylmethyl-amino}-2-methyl-propionitrile | CHEMBL91169
TypeSmall organic molecule
Emp. Form.C26H30N8O
Mol. Mass.470.5694
SMILESCOc1ccc(CNc2nc(nc3n(cnc23)C(C)C)N(CC(C)C#N)Cc2cccnc2)cc1