Reaction Details
TargetCyclin-dependent kinase 2/G1/S-specific cyclin-E1/G1/S-specific cyclin-E2
LigandBDBM50290613
Substrate/Competitorn/a
Meas. Tech.ChEMBL_42810 (CHEMBL877293)
IC50 1000±n/a nM
Citation Schow, SRMackman, RLBlum, CLBrooks, EHorsma, AGJoly, AKerwar, SSLee, GShiffman, DNelson, MGWang, XWick, MMZhang, XLum, RT Synthesis and activity of 2,6,9-trisubstituted purines Bioorg Med Chem Lett7:2697-2702 (1997)    Article
 
Cyclin-dependent kinase 2/G1/S-specific cyclin-E1/G1/S-specific cyclin-E2
Name:Cyclin-dependent kinase 2/G1/S-specific cyclin-E1/G1/S-specific cyclin-E2
Type:n/a
Mol. Mass.:n/a
Description:ASSAY_ID of EBI is 52510
Components:This complex has 3 components.
Component 1
Name:G1/S-specific cyclin-E2
Synonyms:CCNE2 CDK3/cyclin E | G1/S-specific cyclin-E2
Type:PROTEIN
Mol. Mass.:46763.82
Organism:Homo sapiens (Human)
Description:EBI_10135
Residue:404
Component 2
Name:Cyclin-dependent kinase 2
Synonyms:CDK2 CDK2_HUMAN Cell division protein kinase 2 Protein cereblon/Cyclin-dependent kinase 2 | p33 protein kinase
Type:Enzyme Subunit
Mol. Mass.:33938.17
Organism:Homo sapiens (Human)
Description:P24941
Residue:298
Component 3
Name:G1/S-specific cyclin-E1
Synonyms:CCNE CCNE1_HUMAN
Type:Enzyme Subunit
Mol. Mass.:47073.17
Organism:Homo sapiens (Human)
Description:n/a
Residue:410
BDBM50290613
NameBDBM50290613
Synonyms:2-[2-[Bis-(2-hydroxy-ethyl)-amino]-6-(4-methoxy-benzylamino)-purin-9-yl]-ethanol | CHEMBL329380
TypeSmall organic molecule
Emp. Form.C19H26N6O4
Mol. Mass.402.4475
SMILESCOc1ccc(CNc2nc(nc3n(CCO)cnc23)N(CCO)CCO)cc1