Reaction Details
TargetMu-type opioid receptor
LigandBDBM50450528
Substrate/Competitorn/a
Meas. Tech.ChEBML_138866
Ki 16±n/a nM
Citation Dondio, GRonzoni, SPetrillo, PDesJarlais, RLRaveglia, LF Pyrrolooctahydroisoquinolines as potent and selective opioid receptor ligands: SAR analysis and docking studies Bioorg Med Chem Lett7:2967-2972 (1997)    Article
 
Mu-type opioid receptor
Name:Mu-type opioid receptor
Type:Enzyme Catalytic Domain
Mol. Mass.:44431.62
Organism:MOUSE
Description:OPIATE Mu OPRM1 MOUSE::P42866
Residue:398
BDBM50450528
NameBDBM50450528
Synonyms:CHEMBL2051964
TypeSmall organic molecule
Emp. Form.C18H27NO3
Mol. Mass.305.4119
SMILESCc1ccc(O)c(c1)C(=O)NC[C@]1(C)C[C@H](O)CC(C)(C)C1