Reaction Details
TargetKappa-type opioid receptor
LigandBDBM50290866
Substrate/Competitorn/a
Meas. Tech.ChEBML_92550
Ki 169±n/a nM
Citation Dondio, GRonzoni, SPetrillo, PDesJarlais, RLRaveglia, LF Pyrrolooctahydroisoquinolines as potent and selective opioid receptor ligands: SAR analysis and docking studies Bioorg Med Chem Lett7:2967-2972 (1997)    Article
 
Kappa-type opioid receptor
Name:Kappa-type opioid receptor
Type:Enzyme
Mol. Mass.:42656.78
Organism:Mus musculus (Mouse)
Description:P33534
Residue:380
BDBM50290866
NameBDBM50290866
Synonyms:(4aR,8aR)-7-Ethyl-4a-(3-hydroxy-phenyl)-3-methyl-4,4a,5,6,7,8,8a,9-octahydro-1H-pyrrolo[3,2-g]isoquinoline-2-carboxylic acid ethyl ester | CHEMBL322181
TypeSmall organic molecule
Emp. Form.C23H30N2O3
Mol. Mass.382.4959
SMILESCCOC(=O)c1[nH]c2C[C@H]3CN(CC)CC[C@@]3(Cc2c1C)c1cccc(O)c1