Reaction Details
TargetDelta-type opioid receptor
LigandBDBM50290868
Substrate/Competitorn/a
Meas. Tech.ChEBML_53570
Ki 2.6±n/a nM
Citation Dondio, GRonzoni, SPetrillo, PDesJarlais, RLRaveglia, LF Pyrrolooctahydroisoquinolines as potent and selective opioid receptor ligands: SAR analysis and docking studies Bioorg Med Chem Lett7:2967-2972 (1997)    Article
 
Delta-type opioid receptor
Name:Delta-type opioid receptor
Type:Enzyme Catalytic Domain
Mol. Mass.:40577.25
Organism:MOUSE
Description:P32300
Residue:372
BDBM50290868
NameBDBM50290868
Synonyms:(4aR,8aS)-6-Ethyl-8a-(3-hydroxy-phenyl)-3-methyl-4,4a,5,6,7,8,8a,9-octahydro-1H-pyrrolo[2,3-g]isoquinoline-2-carboxylic acid diisopropylamide | CHEMBL100911
TypeSmall organic molecule
Emp. Form.C27H39N3O2
Mol. Mass.437.6175
SMILESCCN1CC[C@@]2(Cc3[nH]c(C(=O)N(C(C)C)C(C)C)c(C)c3C[C@H]2C1)c1cccc(O)c1