Reaction Details
TargetKappa-type opioid receptor
LigandBDBM50290871
Substrate/Competitorn/a
Meas. Tech.ChEBML_92550
Ki>1000±n/a nM
Citation Dondio, GRonzoni, SPetrillo, PDesJarlais, RLRaveglia, LF Pyrrolooctahydroisoquinolines as potent and selective opioid receptor ligands: SAR analysis and docking studies Bioorg Med Chem Lett7:2967-2972 (1997)    Article
 
Kappa-type opioid receptor
Name:Kappa-type opioid receptor
Type:Enzyme
Mol. Mass.:42656.78
Organism:Mus musculus (Mouse)
Description:P33534
Residue:380
BDBM50290871
NameBDBM50290871
Synonyms:(4aR,8aS)-6-Ethyl-8a-(3-hydroxy-phenyl)-3-methyl-4,4a,5,6,7,8,8a,9-octahydro-1H-pyrrolo[2,3-g]isoquinoline-2-carboxylic acid dimethylamide | CHEMBL101623
TypeSmall organic molecule
Emp. Form.C23H31N3O2
Mol. Mass.381.5111
SMILESCCN1CC[C@@]2(Cc3[nH]c(C(=O)N(C)C)c(C)c3C[C@H]2C1)c1cccc(O)c1