Reaction Details
TargetAdenosine receptor A1
LigandBDBM50290900
Substrate/Competitorn/a
Meas. Tech.ChEBML_29485
Ki 2.7±n/a nM
Citation Ha, SBMelman, NJacobson, KANair, V New base-altered adenosine analogues: Synthesis and affinity at adenosine A1 and A2A receptors Bioorg Med Chem Lett7:3085-3090 (1997)    Article
 
Adenosine receptor A1
Name:Adenosine receptor A1
Type:Protein
Mol. Mass.:36704.13
Organism:Rattus norvegicus (rat)
Description:n/a
Residue:326
BDBM50290900
NameBDBM50290900
Synonyms:(2R,3S,4R,5R)-2-Hydroxymethyl-5-[6-((S)-2-hydroxy-1-methyl-2-phenyl-ethylamino)-purin-9-yl]-tetrahydro-furan-3,4-diol | CHEMBL321536
TypeSmall organic molecule
Emp. Form.C19H23N5O5
Mol. Mass.401.4164
SMILESCC(Nc1ncnc2n(cnc12)[C@@H]1O[C@H](CO)[C@@H](O)[C@H]1O)[C@@H](O)c1ccccc1