Reaction Details
TargetAdenosine receptor A1
LigandBDBM50281138
Substrate/Competitorn/a
Meas. Tech.ChEBML_29485
Ki 4.9±n/a nM
Citation Ha, SBMelman, NJacobson, KANair, V New base-altered adenosine analogues: Synthesis and affinity at adenosine A1 and A2A receptors Bioorg Med Chem Lett7:3085-3090 (1997)    Article
 
Adenosine receptor A1
Name:Adenosine receptor A1
Type:Protein
Mol. Mass.:36704.13
Organism:Rattus norvegicus (rat)
Description:n/a
Residue:326
BDBM50281138
NameBDBM50281138
Synonyms:(2R,3R,4S,5R)-2-[2-Chloro-6-(morpholin-4-ylamino)-purin-9-yl]-5-hydroxymethyl-tetrahydro-furan-3,4-diol | CHEMBL313306
TypeSmall organic molecule
Emp. Form.C14H19ClN6O5
Mol. Mass.386.791
SMILESOC[C@H]1O[C@H]([C@H](O)[C@@H]1O)n1cnc2c(NN3CCOCC3)nc(Cl)nc12