Reaction Details
TargetNeprilysin
LigandBDBM50064106
Substrate/Competitorn/a
Meas. Tech.ChEBML_144318
IC50 0.900000±n/a nM
Citation De Lombaert, SStamford, LBBlanchard, LTan, JHoyer, DDiefenbacher, CGWei, DWallace, EMMoskal, MASavage, PJeng, AY Potent non-peptidic dual inhibitors of endothelin-converting enzyme and neutral endopeptidase 24.11 Bioorg Med Chem Lett7:1059-1064 (1997)    Article
 
Neprilysin
Name:Neprilysin
Type:Enzyme
Mol. Mass.:85505.38
Organism:Homo sapiens (Human)
Description:P08473
Residue:750
BDBM50064106
NameBDBM50064106
Synonyms:CGS-26303 {[(R)-2-Biphenyl-4-yl-1-(1H-tetrazol-5-yl)-ethylamino]-methyl}-phosphonic acid {[(S)-2-Biphenyl-4-yl-1-(2H-tetrazol-5-yl)-ethylamino]-methyl}-phosphonic acid | {[2-Biphenyl-4-yl-1-(1H-tetrazol-5-yl)-ethylamino]-methyl}-phosphonic acid(CGS 26303)
TypeSmall organic molecule
Emp. Form.C16H18N5O3P
Mol. Mass.359.3196
SMILESOP(O)(=O)CN[C@@H](Cc1ccc(cc1)-c1ccccc1)c1nnn[nH]1