Reaction Details
TargetMuscarinic acetylcholine receptor M2
LigandBDBM50291602
Substrate/Competitorn/a
Meas. Tech.ChEBML_140112
Ki>10000±n/a nM
Citation Hudkins, RLDeHaven-Hudkins, DLDoukas, P Design of dual acting anticonvulsant-antimuscarinic succinimide and hydantoin derivatives Bioorg Med Chem Lett7:979-984 (1997)    Article
 
Muscarinic acetylcholine receptor M2
Name:Muscarinic acetylcholine receptor M2
Type:Enzyme Catalytic Domain
Mol. Mass.:51555.53
Organism:RAT
Description:P10980
Residue:466
BDBM50291602
NameBDBM50291602
Synonyms:1'-(4-diethylamino-2-butynyl)spiro[2,3-dihydro-1H-indene-1,3'-(tetrahydro-1'H-pyrrole)]-2',5'-dione | CHEMBL368190
TypeSmall organic molecule
Emp. Form.C20H24N2O2
Mol. Mass.324.4168
SMILESCCN(CC)CC#CCN1C(=O)CC2(CCc3ccccc23)C1=O