Reaction Details
TargetMuscarinic acetylcholine receptor M2
LigandBDBM50291599
Substrate/Competitorn/a
Meas. Tech.ChEBML_140112
Ki>10000±n/a nM
Citation Hudkins, RLDeHaven-Hudkins, DLDoukas, P Design of dual acting anticonvulsant-antimuscarinic succinimide and hydantoin derivatives Bioorg Med Chem Lett7:979-984 (1997)    Article
 
Muscarinic acetylcholine receptor M2
Name:Muscarinic acetylcholine receptor M2
Type:Enzyme Catalytic Domain
Mol. Mass.:51555.53
Organism:RAT
Description:P10980
Residue:466
BDBM50291599
NameBDBM50291599
Synonyms:1'-(4-diethylamino-2-butynyl)spiro[9H-fluorene-9,3'-(tetrahydro-1'H-pyrrole)]-2',5'-dione | CHEMBL176228
TypeSmall organic molecule
Emp. Form.C24H24N2O2
Mol. Mass.372.4596
SMILESCCN(CC)CC#CCN1C(=O)CC2(C1=O)c1ccccc1-c1ccccc21