Reaction Details
TargetMuscarinic acetylcholine receptor M2
LigandBDBM39341
Substrate/Competitorn/a
Meas. Tech.ChEBML_140112
Ki 267±n/a nM
Citation Hudkins, RLDeHaven-Hudkins, DLDoukas, P Design of dual acting anticonvulsant-antimuscarinic succinimide and hydantoin derivatives Bioorg Med Chem Lett7:979-984 (1997)    Article
 
Muscarinic acetylcholine receptor M2
Name:Muscarinic acetylcholine receptor M2
Type:Enzyme Catalytic Domain
Mol. Mass.:51555.53
Organism:RAT
Description:P10980
Residue:466
BDBM39341
NameBDBM39341
Synonyms:11-[(4-methylpiperazin-1-yl)acetyl]-5,11-dihydro-6H-pyrido[2,3-b][1,4]benzodiazepin-6-one 11-[2-(4-methylpiperazin-1-yl)acetyl]-5H-pyrido[2,3-b][1,4]benzodiazepin-6-one;hydrochloride 11-[2-(4-methylpiperazino)acetyl]-5H-pyrido[2,3-b][1,4]benzodiazepin-6-one;hydrochloride MLS000069702 PIRENZEPINE DIHYDROCHLORIDE cid_185248
TypeSmall organic molecule
Emp. Form.C19H21N5O2
Mol. Mass.351.4023
SMILESCN1CCN(CC(=O)N2c3ccccc3C(=O)Nc3cccnc23)CC1