Reaction Details
TargetDelta-type opioid receptor
LigandBDBM50450653
Substrate/Competitorn/a
Meas. Tech.ChEMBL_146650 (CHEMBL754934)
IC50 0.010000±n/a nM
Citation Horikawa, MShigeri, YYumoto, NYoshikawa, SNakajima, TOhfune, Y Syntheses of potent Leu-enkephalin analogs possessing beta-hydroxy-alpha,alpha-disubstituted-alpha-amino acid and their characterization to opioid receptors. Bioorg Med Chem Lett8:2027-32 (1999) Delta-type opioid receptor
Name:Delta-type opioid receptor
Type:G Protein-Coupled Receptor (GPCR)
Mol. Mass.:40465.04
Organism:Rattus norvegicus (rat)
Description:Competition binding assays were using CHO-K1 cell membranes expressing the opioid receptor.
Residue:372
BDBM50450653
NameBDBM50450653
Synonyms:CHEMBL2115493
TypeSmall organic molecule
Emp. Form.C33H45N5O8
Mol. Mass.639.7391
SMILESCC(C)C[C@@H](NC(=O)[C@@H](Cc1ccccc1)NC(=O)CNC(=O)[C@]1(CCCC[C@@H]1O)NC(=O)[C@H](N)Cc1ccc(O)cc1)C(O)=O