Reaction Details
TargetKappa-type opioid receptor
LigandBDBM50450656
Substrate/Competitorn/a
Meas. Tech.ChEBML_92559
IC50>10000±n/a nM
Citation Horikawa, MShigeri, YYumoto, NYoshikawa, SNakajima, TOhfune, Y Syntheses of potent Leu-enkephalin analogs possessing beta-hydroxy-alpha,alpha-disubstituted-alpha-amino acid and their characterization to opioid receptors. Bioorg Med Chem Lett8:2027-32 (1999) Kappa-type opioid receptor
Name:Kappa-type opioid receptor
Type:G Protein-Coupled Receptor (GPCR)
Mol. Mass.:42692.90
Organism:Rattus norvegicus (rat)
Description:P34975
Residue:380
BDBM50450656
NameBDBM50450656
Synonyms:CHEMBL2114469
TypeSmall organic molecule
Emp. Form.C32H43N5O8
Mol. Mass.625.7125
SMILESCC(C)C[C@@H](NC(=O)[C@@H](Cc1ccccc1)NC(=O)CNC(=O)[C@]1(CCC[C@@H]1O)NC(=O)[C@H](N)Cc1ccc(O)cc1)C(O)=O