Reaction Details
TargetMu-type opioid receptor
LigandBDBM50071199
Substrate/Competitorn/a
Meas. Tech.ChEBML_139014
IC50 158±n/a nM
Citation Horikawa, MShigeri, YYumoto, NYoshikawa, SNakajima, TOhfune, Y Syntheses of potent Leu-enkephalin analogs possessing beta-hydroxy-alpha,alpha-disubstituted-alpha-amino acid and their characterization to opioid receptors. Bioorg Med Chem Lett8:2027-32 (1999) Mu-type opioid receptor
Name:Mu-type opioid receptor
Type:G Protein-Coupled Receptor (GPCR)
Mol. Mass.:44503.11
Organism:Rattus norvegicus (rat)
Description:Competition binding assays were carried out using membrane preparations from transfected HN9.10 cells that constitutively expressed the mu opioid receptor.
Residue:398
BDBM50071199
NameBDBM50071199
Synonyms:(R)-2-[(R)-2-(2-{2-[(R)-2-Amino-3-(4-hydroxy-phenyl)-propionylamino]-2-methyl-propionylamino}-acetylamino)-3-phenyl-propionylamino]-4-methyl-pentanoic acid | CHEMBL2373084
TypeSmall organic molecule
Emp. Form.C30H41N5O7
Mol. Mass.583.6758
SMILESCC(C)C[C@H](NC(=O)[C@H](Cc1ccccc1)NC(=O)CNC(=O)C(C)(C)NC(=O)[C@@H](N)Cc1ccc(O)cc1)C(O)=O