Reaction Details
TargetAlpha-1A adrenergic receptor
LigandBDBM50071685
Substrate/Competitorn/a
Meas. Tech.ChEBML_32885
Ki 0.510000±n/a nM
Citation Patane, MADiPardo, RMPrice, RPChang, RSRansom, RWO'Malley, SSDi Salvo, JBock, MG Selective alpha-1a adrenergic receptor antagonists. Effects of pharmacophore regio- and stereochemistry on potency and selectivity. Bioorg Med Chem Lett8:2495-500 (1999) Alpha-1A adrenergic receptor
Name:Alpha-1A adrenergic receptor
Type:Cell-surface receptors
Mol. Mass.:51511.67
Organism:Homo sapiens (Human)
Description:P35348
Residue:466
BDBM50071685
NameBDBM50071685
Synonyms:(1R,3S,4S)-1-[4-(5-Chloro-1,1,3-trioxo-1,3-dihydro-1lambda*6*-benzo[d]isothiazol-2-yl)-butyl]-4-phenyl-piperidine-3-carboxylic acid ethyl ester | CHEMBL82267
TypeSmall organic molecule
Emp. Form.C25H29ClN2O5S
Mol. Mass.505.026
SMILESCCOC(=O)[C@@H]1CN(CCCCN2C(=O)c3cc(Cl)ccc3S2(=O)=O)CC[C@@H]1c1ccccc1