Reaction Details
Target3-oxo-5-alpha-steroid 4-dehydrogenase 1
LigandBDBM50072190
Substrate/Competitorn/a
Meas. Tech.ChEMBL_204898 (CHEMBL808567)
Ki 920±n/a nM
Citation Guarna, AOcchiato, EGScarpi, DTsai, RDanza, GComerci, AMancina, RSerio, M Synthesis of benzo[c]quinolizin-3-ones: selective non-steroidal inhibitors of steroid 5 alpha-reductase 1. Bioorg Med Chem Lett8:2871-6 (1999) 3-oxo-5-alpha-steroid 4-dehydrogenase 1
Name:3-oxo-5-alpha-steroid 4-dehydrogenase 1
Type:Enzyme
Mol. Mass.:29472.80
Organism:Homo sapiens (Human)
Description:P18405
Residue:259
BDBM50072190
NameBDBM50072190
Synonyms:(R)-8-Chloro-4,10b-dimethyl-1,5,6,10b-tetrahydro-2H-phenanthridin-3-one | CHEMBL97266
TypeSmall organic molecule
Emp. Form.C15H16ClNO
Mol. Mass.261.747
SMILESCC1C(=O)CC[C@@]2(C)C1=NCc1cc(Cl)ccc21