Reaction Details
Target3-oxo-5-alpha-steroid 4-dehydrogenase 2
LigandBDBM50072190
Substrate/Competitorn/a
Meas. Tech.ChEBML_204905
Ki 20000±n/a nM
Citation Guarna, AOcchiato, EGScarpi, DTsai, RDanza, GComerci, AMancina, RSerio, M Synthesis of benzo[c]quinolizin-3-ones: selective non-steroidal inhibitors of steroid 5 alpha-reductase 1. Bioorg Med Chem Lett8:2871-6 (1999) 3-oxo-5-alpha-steroid 4-dehydrogenase 2
Name:3-oxo-5-alpha-steroid 4-dehydrogenase 2
Type:Enzyme
Mol. Mass.:28406.59
Organism:Homo sapiens (Human)
Description:P31213
Residue:254
BDBM50072190
NameBDBM50072190
Synonyms:(R)-8-Chloro-4,10b-dimethyl-1,5,6,10b-tetrahydro-2H-phenanthridin-3-one | CHEMBL97266
TypeSmall organic molecule
Emp. Form.C15H16ClNO
Mol. Mass.261.747
SMILESCC1C(=O)CC[C@@]2(C)C1=NCc1cc(Cl)ccc21