Reaction Details
TargetLysosomal alpha-glucosidase
LigandBDBM50070029
Substrate/Competitorn/a
Meas. Tech.ChEBML_34406
Ki 75000±n/a nM
Citation Therisod, HLetourneux, YTherisod, M A new strong inhibitor of beta-mannosidase. Bioorg Med Chem Lett8:371-2 (1999) Lysosomal alpha-glucosidase
Name:Lysosomal alpha-glucosidase
Type:PROTEIN
Mol. Mass.:105312.45
Organism:Homo sapiens (Human)
Description:ChEMBL_1506060
Residue:952
BDBM50070029
NameBDBM50070029
Synonyms:(2Z)-3,4,5-trihydroxy-6-(hydroxymethyl)tetrahydro-2H-pyran-2-one O-(anilinocarbonyl)oxime | CHEMBL62552
TypeSmall organic molecule
Emp. Form.C13H16N2O7
Mol. Mass.312.2753
SMILESOCC1OC(=NOC(=O)Nc2ccccc2)C(O)C(O)C1O