Reaction Details
TargetSodium-dependent noradrenaline transporter
LigandBDBM50025691
Substrate/Competitorn/a
Meas. Tech.ChEBML_142806
Kd 155±n/a nM
Citation Carlier, PRLo, MMLo, PCRichelson, ETatsumi, MReynolds, IJSharma, TA Synthesis of a potent wide-spectrum serotonin-, norepinephrine-, dopamine-reuptake inhibitor (SNDRI) and a species-selective dopamine-reuptake inhibitor based on the gamma-amino alcohol functional group. Bioorg Med Chem Lett8:487-92 (1999) Sodium-dependent noradrenaline transporter
Name:Sodium-dependent noradrenaline transporter
Type:Multi-pass membrane protein
Mol. Mass.:69337.72
Organism:Homo sapiens (Human)
Description:P23975
Residue:617
BDBM50025691
NameBDBM50025691
Synonyms:2-(2-Ethoxy-phenoxymethyl)-morpholine 2-(2-Ethoxy-phenoxymethyl)-morpholine(viloxazine) VILOXAZINE
TypeSmall organic molecule
Emp. Form.C13H19NO3
Mol. Mass.237.2949
SMILESCCOc1ccccc1OCC1CNCCO1