Reaction Details
TargetGlycogen phosphorylase, liver form
LigandBDBM50263769
Substrate/Competitorn/a
Meas. Tech.ChEMBL_99190 (CHEMBL711968)
Ki 7000±n/a nM
Citation Osz, ESomsák, LSzilágyi, LKovács, LDocsa, TTóth, BGergely, P Efficient inhibition of muscle and liver glycogen phosphorylases by a new glucopyranosylidene-spiro-thiohydantoin. Bioorg Med Chem Lett9:1385-90 (1999) Glycogen phosphorylase, liver form
Name:Glycogen phosphorylase, liver form
Type:PROTEIN
Mol. Mass.:97489.46
Organism:Rattus norvegicus
Description:ChEMBL_1491377
Residue:850
BDBM50263769
NameBDBM50263769
Synonyms:(5S,7R,8S,9S,10R)-8,9,10-Trihydroxy-7-hydroxymethyl-2-thioxo-6-oxa-1,3-diaza-spiro[4.5]decan-4-one 8,9,10-TRIHYDROXY-7-HYDROXYMETHYL-2-THIOXO-6-OXA-1,3-DIAZA-SPIRO[4.5]DECAN-4-ONE | CHEMBL489798
TypeSmall organic molecule
Emp. Form.C8H12N2O6S
Mol. Mass.264.256
SMILESOC[C@H]1O[C@@]2(NC(=S)NC2=O)[C@H](O)[C@@H](O)[C@@H]1O