Reaction Details
TargetReverse transcriptase/RNaseH
LigandBDBM50078260
Substrate/Competitorn/a
Meas. Tech.ChEBML_195505
IC50 5800±n/a nM
Citation Mao, CSudbeck, EAVenkatachalam, TKUckun, FM Rational design of N-[2-(2,5-dimethoxyphenylethyl)]-N'-[2-(5-bromopyridyl)]-thiourea (HI-236) as a potent non-nucleoside inhibitor of drug-resistant human immunodeficiency virus. Bioorg Med Chem Lett9:1593-8 (1999) Reverse transcriptase/RNaseH
Name:Reverse transcriptase/RNaseH
Type:PROTEIN
Mol. Mass.:65229.15
Organism:Human immunodeficiency virus 1
Description:ChEMBL_1473730
Residue:566
BDBM50078260
NameBDBM50078260
Synonyms:1-(5-Bromo-pyridin-2-yl)-3-piperidin-1-ylmethyl-thiourea HI-172
TypeSmall organic molecule
Emp. Form.C12H17BrN4S
Mol. Mass.329.259
SMILESBrc1ccc(NC(=S)NCN2CCCCC2)nc1