Reaction Details
TargetReverse transcriptase/RNaseH
LigandBDBM50078262
Substrate/Competitorn/a
Meas. Tech.ChEBML_195505
IC50 7000±n/a nM
Citation Mao, CSudbeck, EAVenkatachalam, TKUckun, FM Rational design of N-[2-(2,5-dimethoxyphenylethyl)]-N'-[2-(5-bromopyridyl)]-thiourea (HI-236) as a potent non-nucleoside inhibitor of drug-resistant human immunodeficiency virus. Bioorg Med Chem Lett9:1593-8 (1999) Reverse transcriptase/RNaseH
Name:Reverse transcriptase/RNaseH
Type:PROTEIN
Mol. Mass.:65229.15
Organism:Human immunodeficiency virus 1
Description:ChEMBL_1473730
Residue:566
BDBM50078262
NameBDBM50078262
Synonyms:4-(3,5-Dimethyl-benzyl)-3-isopropyl-6-methylsulfanylmethylsulfanyl-1H-pyridin-2-one HI-281
TypeSmall organic molecule
Emp. Form.C19H25NOS2
Mol. Mass.347.538
SMILESCSCSc1cc(Cc2cc(C)cc(C)c2)c(C(C)C)c(=O)[nH]1