Reaction Details
TargetReverse transcriptase/RNaseH
LigandBDBM50078261
Substrate/Competitorn/a
Meas. Tech.ChEBML_195505
IC50 700±n/a nM
Citation Mao, CSudbeck, EAVenkatachalam, TKUckun, FM Rational design of N-[2-(2,5-dimethoxyphenylethyl)]-N'-[2-(5-bromopyridyl)]-thiourea (HI-236) as a potent non-nucleoside inhibitor of drug-resistant human immunodeficiency virus. Bioorg Med Chem Lett9:1593-8 (1999) Reverse transcriptase/RNaseH
Name:Reverse transcriptase/RNaseH
Type:PROTEIN
Mol. Mass.:65229.15
Organism:Human immunodeficiency virus 1
Description:ChEMBL_1473730
Residue:566
BDBM50078261
NameBDBM50078261
Synonyms:1-(5-Bromo-pyridin-2-yl)-3-[2-(2-chloro-phenyl)-ethyl]-thiourea | CHEMBL40631
TypeSmall organic molecule
Emp. Form.C14H13BrClN3S
Mol. Mass.370.695
SMILESClc1ccccc1CCNC(=S)Nc1ccc(Br)cn1