Reaction Details
TargetInterstitial collagenase
LigandBDBM8465
Substrate/Competitorn/a
Meas. Tech.ChEBML_101748
IC50 96±n/a nM
Citation Hanessian, SBouzbouz, SBoudon, ATucker, GCPeyroulan, D Picking the S1, S1' and S2' pockets of matrix metalloproteinases. A niche for potent acyclic sulfonamide inhibitors. Bioorg Med Chem Lett9:1691-6 (1999) Interstitial collagenase
Name:Interstitial collagenase
Type:Enzyme
Mol. Mass.:54010.26
Organism:Homo sapiens (Human)
Description: P03956
Residue:469
BDBM8465
NameBDBM8465
Synonyms:(2R)-N-hydroxy-2-[(4-methoxybenzene)(pyridin-3-ylmethyl)sulfonamido]-3-methylbutanamide CGS 27023 CHEMBL514138 | hydroxamate analogue 1
TypeSmall organic molecule
Emp. Form.C18H23N3O5S
Mol. Mass.393.457
SMILESCOc1ccc(cc1)S(=O)(=O)N(Cc1cccnc1)[C@H](C(C)C)C(=O)NO