Reaction Details
TargetCannabinoid receptor 1
LigandBDBM50080104
Substrate/Competitorn/a
Meas. Tech.ChEBML_46441
Ki 98±n/a nM
Citation Kanyonyo, MGovaerts, SJHermans, EPoupaert, JHLambert, DM 3-Alkyl-(5,5'-diphenyl)imidazolidineiones as new cannabinoid receptor ligands. Bioorg Med Chem Lett9:2233-6 (1999) Cannabinoid receptor 1
Name:Cannabinoid receptor 1
Type:G Protein-Coupled Receptor (GPCR)
Mol. Mass.:52868.96
Organism:Homo sapiens (Human)
Description:P21554
Residue:472
BDBM50080104
NameBDBM50080104
Synonyms:5,5-Bis-(4-bromo-phenyl)-3-heptyl-imidazolidine-2,4-dione CHEMBL49407
TypeSmall organic molecule
Emp. Form.C22H24Br2N2O2
Mol. Mass.508.246
SMILESCCCCCCCN1C(=O)NC(C1=O)(c1ccc(Br)cc1)c1ccc(Br)cc1