Reaction Details
TargetAlpha-1B adrenergic receptor
LigandBDBM50081820
Substrate/Competitorn/a
Meas. Tech.ChEMBL_33012 (CHEMBL643868)
Ki 18±n/a nM
Citation Marzabadi, MRHong, XNagarathnam, DMiao, SWChiu, GWong, WCWetzel, JMFang, JForray, CChen, TBO'Malley, SSChang, RSGluchowski, C Design and synthesis of novel dihydropyridine alpha-1a antagonists. Bioorg Med Chem Lett9:2843-8 (1999) Alpha-1B adrenergic receptor
Name:Alpha-1B adrenergic receptor
Type:Enzyme
Mol. Mass.:56862.13
Organism:Homo sapiens (Human)
Description:P35368
Residue:520
BDBM50081820
NameBDBM50081820
Synonyms:2-(2-Amino-ethoxymethyl)-6-methyl-4-(4-nitro-phenyl)-1,4-dihydro-pyridine-3,5-dicarboxylic acid 5-amide 3-{[3-(4-phenyl-piperidin-1-yl)-propyl]-amide} | CHEMBL95548
TypeSmall organic molecule
Emp. Form.C31H40N6O5
Mol. Mass.576.6865
SMILESCC1=NC(COCCN)=C(C(C1C(N)=O)c1ccc(cc1)[N+]([O-])=O)C(=O)NCCCN1CCC(CC1)c1ccccc1